 HDL-CEC,PID,Cohort,Age at Sampling,Sex,Race,Ethnicity,ALT,AST,Creatinine,CRP,Hematocrit,Hemoglobin,Mean Plt Volume,Platelet Count,RDW1_colldate,WBC Count,bmi_admit,Avg_SBP,Avg_DBP,enc_medserve_1,icu_yn,total_icu_duration,Unnamed: 23,Unnamed: 24,enc_dx_Upper Resp,enc_dx_Pulm,enc_dx_Cards/Lipids,enc_dx_Endo,enc_dx_GI,enc_dx_Obesity/CMR,enc_dx_Renal,enc_dx_Infectious/ Including COVID,enc_dx_Immuno-compromise/ARDS/MISC,enc_dx_Thrombosis/Heme/ Onc,enc_dx_Psych,enc_dx_CNS or Syndromic,enc_dx_Trauma or Burn,enc_dx_Other/ Iatrogenesis Pain/Derm/ Malnutrition,enc_meds_Analgesic/Antipyrtic,Antibiotics,Anticoaglant/Thrombotic,Antihypertensive,Antisz/CNS,Antiviral/fungal/parasite,CV & Lipid Rx,Glucoreg,Immunosuppression,IVIG,Psychotropic,Respiratory,Other,GlycA,BHB,AA,BHB:AA ratio,Acetone,Ketone bodies,TG,TC,TRL-TG,TRL-C,LDL-C,HDL-C,ApoA1,ApoB,TRL-P,VL_TRL-P,L_TRL-P,M_TRL-P,S_TRL-P,VS_TRL-P,LDL-P,L_LDL-P,M_LDL-P,S_LDL-P,HDL-P,L_HDL-P,M_HDL-P,S_HDL-P,Valine,Leucine,Isoleucine,BCAA,Alanine,LPX,LPZ
.8923204976968984,126,MISC,14,F,Black or African American,"Not Hispanic, Latino, or Spanish Origin",44,26.0,0.79,,33.5,11.3,9.3,,0.0,18.99,,111.44444444444444,69.11111111111111,Critical Care Medicine,y,7.080555555497995,4.0,BiPAP/CPAP,0,1,5,0,1,3,0,4,1,1,0,0,2,6,4,3,4,1,1,0,3,0,3,1,1,0,13,489.1,62.3,34.4,1.811046512,27.8,124.5,141.9,195.7,103.2,41.8,107.0,46.9,105.1,94.3,236.8,0.0,8.3,5.0,61.7,161.9,1483.8,682.3,44.8,756.7,14.4,1.1,7.3,6.0,242.3,151.2,57.5,451.0,441.8,0.0,0.0
.3768821742634628,63,MISC,2,M,Black or African American,"Not Hispanic, Latino, or Spanish Origin",,,0.51,9.31,28.0,9.6,8.6,488.0,0.0,8.13,18.17,107.79629629629628,72.14814814814817,Emergency Room,n,0.0,4.0,BiPAP/CPAP,0,1,0,0,0,0,1,1,1,0,0,0,0,3,3,0,3,2,1,0,3,0,2,1,1,0,11,651.0,1016.4,199.5,5.094736842,72.5,1288.4,47.5,90.8,24.8,10.7,68.4,11.7,25.9,60.8,65.7,0.1,0.7,1.5,18.0,45.5,1240.6,121.3,0.0,1119.3,3.0,0.8,1.7,0.5,196.1,145.2,40.1,381.3,210.6,0.0,0.0
.7387784875861123,125,MISC,2,M,Black or African American,"Not Hispanic, Latino, or Spanish Origin",21,26.0,0.24,.09,32.4,11.3,,554.0,0.0,6.36,,101.58823529411764,61.23529411764706,Radiology,n,0.0,,,0,0,0,0,0,0,0,0,1,0,0,0,0,0,4,2,2,1,1,0,6,0,3,1,1,0,11,,,,,,,,,,,,,,,,,,,,,,,,,,,,,,,,,,,
.4624783585527873,113,MISC,19,M,Other Race,"Hispanic, Latino, or Spanish Origin",64,50.0,0.84,,36.1,12.4,9.8,650.0,0.0,6.58,,114.25,63.75,Critical Care Medicine,y,4.784513888895162,5.0,Vent,0,1,2,1,2,0,2,4,1,1,1,0,0,5,3,3,3,0,1,0,3,1,2,1,2,0,12,375.5,53.8,1.6,33.625,14.8,70.2,105.3,92.3,48.5,32.4,35.7,24.2,44.6,73.3,226.2,0.1,0.0,0.3,54.3,171.6,1045.5,133.1,0.0,69.1,5.7,1.2,2.2,2.4,225.3,130.0,57.6,412.9,411.4,0.0,843.3
.40948889489522267,33,MISC,14,M,Black or African American,"Not Hispanic, Latino, or Spanish Origin",12,18.0,0.56,.64,,,8.7,804.0,,5.53,,101,65.8,Critical Care Medicine,y,4.162453703705978,3.0,NC or Mask,0,0,3,0,0,0,0,3,1,0,1,0,0,2,2,1,2,2,0,0,3,0,2,1,0,0,8,309.2,46.6,5.2,8.961538462,11.4,63.2,155.9,94.6,59.8,31.8,34.8,28.0,43.3,99.3,184.5,0.1,0.5,4.9,85.6,93.3,1560.2,0.0,0.0,0.0,5.1,1.5,2.7,0.8,191.8,156.5,75.7,424.1,299.3,0.0,1560.2
.7540979145597156,52,MISC,5,M,Other Race,"Hispanic, Latino, or Spanish Origin",38,37.0,0.33,,37.1,12.0,10.1,324.0,0.0,5.92,,,,Hematology,n,0.0,,,0,0,0,0,0,0,0,0,1,0,0,0,0,1,0,0,1,0,0,0,0,0,0,0,0,0,0,262.8,72.3,17.1,4.228070175,4.2,93.5,65.8,113.4,43.1,17.9,67.6,27.9,71.3,58.5,99.0,0.2,0.2,4.7,57.3,36.6,987.7,346.7,51.0,590.0,10.7,0.6,5.8,4.3,177.4,103.0,46.3,326.7,260.4,0.0,0.0
1.0532409373202587,54,MISC,4,F,Other Race,"Hispanic, Latino, or Spanish Origin",28,54.0,0.37,.43,33.4,11.5,10.0,412.0,0.905555555560568,6.58,15.83,89.25,55.625,Critical Care Medicine,y,5.673865740696783,5.0,Vent,0,2,2,0,0,0,0,3,0,0,1,1,0,2,2,3,3,1,1,0,5,0,3,1,4,1,9,450.1,52.0,7.7,6.753246753,21.9,81.6,133.9,129.0,107.6,27.7,72.6,28.7,59.7,65.4,100.4,0.3,6.2,17.2,60.3,16.5,1136.2,340.9,18.3,777.0,7.0,1.7,4.8,0.5,219.6,144.5,51.1,415.2,490.1,0.0,0.0
.6856433265998756,111,MISC,8,F,Black or African American,"Not Hispanic, Latino, or Spanish Origin",,,0.51,.39,31.0,9.6,10.7,699.0,-0.984027777783922,12.1,26.67,115,72.57142857142857,Critical Care Medicine,y,7.004085648099135,5.0,Vent,0,1,3,0,0,0,1,5,1,5,1,0,0,2,4,3,2,2,1,1,3,0,3,1,2,1,11,536.5,108.7,17.9,6.072625698,18.2,144.8,93.4,162.2,57.8,17.8,102.1,42.3,104.5,79.1,95.6,0.2,4.8,5.4,8.7,76.6,1484.9,626.5,0.0,858.4,15.3,0.7,5.6,9.0,365.4,260.9,81.5,707.8,512.6,0.0,0.0
.7486428184430581,121,MISC,13,F,Black or African American,"Not Hispanic, Latino, or Spanish Origin",16,22.0,0.51,.23,34.2,10.8,12.1,275.0,0.0,3.69,17.99,112,74,Rheumatology,n,0.0,,,0,0,0,0,0,0,0,0,1,0,0,0,0,0,0,0,0,0,0,0,0,0,0,0,0,0,0,259.5,50.2,21.5,2.334883721,10.7,82.4,51.7,133.7,22.9,11.9,59.3,62.6,124.6,46.5,77.6,0.1,0.0,0.0,24.7,52.8,794.9,421.8,21.4,351.6,15.2,5.1,4.1,5.9,198.9,149.6,52.0,400.5,360.8,0.0,0.0
.32537505334280836,116,MISC,13,M,Black or African American,"Not Hispanic, Latino, or Spanish Origin",101,204.0,1.57,25.31,30.2,10.1,,,-0.538888888891961,21.5,35.83,110.7391304347826,52.78260869565218,Critical Care Medicine,y,7.231064814804996,5.0,Vent,0,1,10,0,1,0,4,4,2,0,0,1,0,8,5,2,4,2,2,1,6,0,3,1,5,1,20,628.4,455.0,94.5,4.814814815,27.2,576.7,193.8,102.9,160.6,86.4,16.5,0.0,0.0,81.9,505.1,0.2,0.0,31.9,215.9,257.1,588.9,0.0,0.0,0.0,0.0,0.0,0.0,0.0,418.6,289.2,55.1,762.9,863.4,0.0,588.9
.31038310286025145,118,MISC,16,M,Caucasian,"Not Hispanic, Latino, or Spanish Origin",34,30.0,0.72,9.1,31.6,10.6,,,-0.9430555555591128,6.02,20.77,108.33333333333331,65.5,Critical Care Medicine,y,1.6066087963044993,4.0,BiPAP/CPAP,0,1,5,0,0,0,0,4,2,0,0,0,0,2,2,2,2,1,1,0,1,0,2,1,0,0,8,520.7,341.7,91.8,3.722222222,19.3,452.8,136.2,79.6,34.1,21.5,48.8,9.3,13.3,105.1,131.2,0.0,0.2,0.1,60.8,70.1,1782.3,0.0,0.0,0.0,1.3,0.8,0.5,0.0,448.7,334.4,66.5,849.6,372.7,0.0,1782.3
.4787241696058824,98,MISC,6,F,Black or African American,"Not Hispanic, Latino, or Spanish Origin",137,165.0,0.33,1.45,,9.1,9.5,701.0,0.0,8.71,18.97,110.33333333333331,75.66666666666667,Critical Care Medicine,y,7.638287036999827,4.0,BiPAP/CPAP,0,2,0,0,2,0,1,2,0,2,1,0,0,2,3,3,2,1,0,0,2,0,1,1,2,0,8,562.4,39.4,15.7,2.50955414,16.4,71.6,245.4,227.0,198.1,67.1,114.9,45.0,100.2,126.1,332.6,0.4,9.1,30.5,122.7,169.9,2081.6,158.9,0.0,1922.7,12.9,2.6,5.2,5.1,265.9,147.7,41.0,454.6,515.0,0.0,0.0
.4082919354215313,35,MISC,14,M,Other Race,"Hispanic, Latino, or Spanish Origin",34,64.0,0.67,16.77,38.3,14.0,10.8,233.0,0.0,8.03,21.13,102.15384615384616,62.46153846153846,Critical Care Medicine,y,0.7621527778028394,3.0,NC or Mask,0,0,2,0,1,0,0,1,2,2,0,0,0,3,1,3,2,0,0,0,1,0,2,1,0,0,6,601.0,295.6,82.9,3.565741858,22.2,400.8,124.8,101.5,36.5,27.2,27.0,25.6,40.6,86.8,216.0,0.1,0.0,0.0,11.0,204.9,1369.0,7.6,0.0,0.0,4.8,1.1,3.6,0.1,246.4,194.8,47.0,488.2,307.7,21.7,1361.4
.7040494222826063,28,MISC,12,M,Other Race,"Hispanic, Latino, or Spanish Origin",24,34.0,0.33,1.48,22.8,8.1,10.8,280.0,0.0,8.98,14.86,102.76923076923076,67.53846153846153,Critical Care Medicine,y,8.751886574100354,3.0,NC or Mask,0,0,2,0,0,0,0,3,1,1,0,0,0,1,1,5,5,1,1,0,2,0,1,1,1,0,13,418.4,44.5,1.3,34.23076923,18.1,63.9,216.2,147.1,150.0,42.4,18.9,21.7,33.3,71.9,190.6,0.0,13.3,22.4,53.2,101.6,1026.8,0.0,0.0,24.1,3.7,1.0,2.4,0.2,144.3,109.5,41.7,295.6,320.3,64.0,1002.7
.5368705031840316,38,MISC,10,M,Black or African American,"Not Hispanic, Latino, or Spanish Origin",29,37.0,0.39,9.25,29.7,9.8,9.4,484.0,0.0,4.67,,120.15384615384616,75.23076923076923,Emergency Room,n,0.0,1.0,Room Air,0,1,0,0,2,0,0,4,2,1,0,0,0,1,5,2,0,0,0,0,1,0,1,1,0,0,7,693.6,100.9,27.8,3.629496403,15.3,144.0,103.7,74.5,18.3,12.9,31.1,30.5,42.8,76.4,85.3,0.0,0.0,0.0,29.1,56.1,1328.7,0.0,0.0,0.0,5.0,1.3,2.9,0.7,409.9,268.4,54.4,732.6,430.4,0.0,1328.7
.29323378439739434,114,MISC,7,F,Other Race,"Hispanic, Latino, or Spanish Origin",114,35.0,0.46,6.59,24.6,8.5,13.4,76.0,0.0,6.22,,93.36046511627907,52.63953488372093,Critical Care Medicine,y,1.7173726851979154,3.0,NC or Mask,0,1,7,0,3,0,1,0,1,2,0,0,0,6,2,0,2,1,0,0,1,0,2,1,0,0,7,644.0,868.0,246.3,3.524157531,61.1,1175.4,151.0,166.0,91.9,35.2,16.2,11.6,23.5,66.5,197.2,0.1,5.4,23.4,32.5,135.9,942.3,8.2,0.0,0.0,3.0,0.5,1.8,0.7,172.4,146.1,30.7,349.1,179.0,102.9,934.0
.4441220623591941,120,MISC,5,F,Asian,"Not Hispanic, Latino, or Spanish Origin",22,19.0,0.32,18.78,25.6,8.8,11.4,106.0,0.0,4.98,17.31,100.94736842105264,65.10526315789474,Critical Care Medicine,y,2.56767361110542,3.0,NC or Mask,0,0,4,0,1,0,0,2,3,2,1,0,0,4,2,3,3,0,0,0,2,0,2,1,2,0,7,626.9,218.7,57.7,3.790294627,20.2,296.7,179.2,208.1,55.2,27.2,45.9,16.3,28.7,120.7,163.5,0.0,1.0,9.3,51.1,102.2,2040.2,0.0,0.0,0.0,3.0,0.7,2.3,0.0,239.2,157.7,22.9,419.8,221.9,118.7,2040.2
.6462592833025765,89,MISC,8,F,Other Race,"Hispanic, Latino, or Spanish Origin",39,28.0,0.36,.79,23.2,7.8,9.8,626.0,0.0,11.32,11.14,98.41666666666667,54.083333333333336,Critical Care Medicine,y,4.569120370397286,3.0,NC or Mask,0,1,3,0,0,0,0,4,0,0,0,0,0,1,2,6,5,1,1,0,2,0,2,1,1,0,10,455.2,46.2,16.8,2.75,0.0,63.0,159.3,140.5,65.4,34.0,56.6,47.3,79.9,107.9,220.2,0.3,1.5,1.1,60.0,157.3,1762.3,24.2,0.0,396.0,9.0,2.8,6.2,0.0,243.3,168.0,36.6,447.9,982.0,2.7,1342.0
,99,MISC,3,F,Unknown,"Not Hispanic, Latino, or Spanish Origin",27,31.0,0.3,6.66,30.4,9.9,10.2,460.0,0.0,4.49,20.53,,,Critical Care Medicine,y,7.13896990739886,3.0,NC or Mask,0,1,3,0,0,0,0,1,0,0,1,0,0,3,0,0,0,0,0,0,0,0,0,0,0,0,0,611.0,191.9,41.8,4.590909091,6.8,240.5,112.5,136.6,44.9,26.7,25.8,26.5,47.9,73.5,178.6,0.0,0.3,3.2,43.8,131.2,1130.4,0.0,0.0,64.9,6.3,1.3,2.4,2.6,261.9,160.6,43.3,465.8,318.6,57.7,1065.5
.4662755269852543,115,MISC,6,F,Caucasian,"Not Hispanic, Latino, or Spanish Origin",19,26.0,0.43,2.85,29.7,10.3,9.6,284.0,-0.9020833333270276,7.2,,97.5,62.25,Critical Care Medicine,y,3.690011574100936,5.0,Vent,0,1,4,0,1,0,0,1,1,2,1,0,0,7,3,3,3,1,1,0,5,0,2,1,2,0,9,632.3,125.3,23.7,5.286919831,4.0,153.0,85.0,108.3,61.2,28.7,57.4,22.2,44.2,64.1,188.0,0.5,0.9,5.0,33.8,147.8,1111.4,17.6,0.0,1093.8,5.3,1.3,2.1,1.8,281.9,228.5,65.8,576.2,408.4,0.0,0.0
.6691486410901306,59,MISC,13,F,Other Race,"Hispanic, Latino, or Spanish Origin",30,15.0,0.6,.1,33.9,11.5,10.2,305.0,0.0,7.81,35.04,120,72,Cardiology,n,0.0,,,0,0,0,0,0,0,0,0,1,0,0,0,0,0,0,0,0,0,0,0,0,0,0,0,0,0,0,379.3,58.3,8.6,6.779069767,25.5,92.4,89.9,162.0,56.2,24.9,94.0,43.0,104.2,79.6,148.6,0.2,1.0,6.0,49.8,91.5,1307.0,436.7,295.8,574.6,15.1,1.0,8.8,5.3,198.8,115.0,30.6,344.4,405.7,0.0,0.0
.3900620492027546,34,MISC,11,M,Black or African American,"Not Hispanic, Latino, or Spanish Origin",25,37.0,0.27,6.54,28.5,9.7,12.2,131.0,0.0,20.02,,118.34782608695652,83.65217391304348,Cardiac Critical Care,y,14.366666666704988,5.0,Vent,0,2,7,1,14,0,2,1,3,11,1,2,0,7,7,5,4,1,1,0,4,0,2,1,4,2,22,492.7,6.8,24.3,0.279835391,19.3,50.5,93.0,52.9,50.4,18.5,11.9,22.4,35.3,42.4,76.9,0.2,2.4,1.4,72.8,0.0,622.6,0.0,0.0,0.0,4.3,0.8,3.5,0.0,191.9,163.5,51.3,406.8,444.4,0.0,622.6
.6761742217967416,91,MISC,5,M,Other Race,"Hispanic, Latino, or Spanish Origin",14,18.0,0.43,2.71,30.0,10.3,10.2,601.0,0.0,6.27,15.27,100.5,67.3,Emergency Room,n,0.0,1.0,Room Air,0,0,0,0,0,0,3,1,0,0,1,0,0,3,3,3,1,0,0,0,1,0,1,1,0,0,6,783.4,1865.1,397.0,4.697984887,24.6,2286.6,69.3,121.4,39.7,20.5,74.9,26.1,51.0,71.6,121.5,0.0,2.0,0.4,46.1,73.0,1352.2,140.3,0.0,1211.9,5.1,1.9,2.8,0.3,278.1,169.0,75.2,522.2,305.7,0.0,0.0
.6411339372136269,128,MISC,8,M,Black or African American,"Not Hispanic, Latino, or Spanish Origin",28,32.0,0.49,.28,35.1,11.2,8.7,684.0,0.0,5.63,22.14,120.5,70.25,Critical Care Medicine,y,6.352245370399032,5.0,Vent,0,1,6,0,4,0,0,9,1,0,1,1,0,2,4,3,3,3,1,0,3,0,2,1,2,0,12,442.5,49.5,17.0,2.911764706,16.7,83.2,55.8,136.3,23.9,9.7,89.9,36.8,88.7,67.9,53.7,0.1,0.8,2.5,19.0,31.3,1308.7,534.9,0.0,773.9,13.1,0.3,5.2,7.6,309.1,204.9,73.2,587.2,386.7,0.0,0.0
.7296655641845279,70,MISC,11,M,Other Race,"Hispanic, Latino, or Spanish Origin",41,27.0,0.47,.49,28.9,10.1,8.6,608.0,0.0,17.24,19.03,100,63.666666666666664,Emergency Room,n,0.0,4.0,BiPAP/CPAP,0,1,0,0,2,0,1,0,1,0,2,0,0,1,4,3,1,1,0,0,1,0,2,1,0,0,11,502.1,95.7,30.0,3.19,9.2,135.0,114.1,172.0,77.6,22.8,107.3,41.9,89.7,83.5,90.0,0.1,5.6,7.4,58.6,18.3,1490.4,742.1,0.0,748.2,11.7,1.4,5.9,4.4,312.2,218.3,99.6,630.1,443.4,0.0,0.0
.571040133658218,56,MISC,4,M,Other Race,"Not Hispanic, Latino, or Spanish Origin",34,34.0,0.45,.22,24.6,8.5,10.7,475.0,0.0,4.77,18.07,100.1,59.9,Critical Care Medicine,y,6.346435185201699,4.0,BiPAP/CPAP,0,1,6,0,1,0,0,1,2,1,0,0,0,6,3,2,4,2,1,0,5,0,2,1,2,0,10,439.4,17.2,8.3,2.072289157,18.4,43.9,172.1,154.2,132.9,24.5,99.2,30.5,56.4,87.4,66.0,0.6,10.0,13.6,38.2,3.6,1776.6,203.2,0.0,1573.3,5.8,1.4,4.3,0.0,375.0,209.0,61.7,645.7,476.5,0.0,0.0
.4207651983071272,22,MISC,16,F,Other Race,"Hispanic, Latino, or Spanish Origin",34,9.0,0.7,31.22,25.2,9.3,12.0,131.0,-0.28333333333284827,16.54,,108.78947368421052,62.28947368421053,Critical Care Medicine,y,7.1359722222041455,4.0,BiPAP/CPAP,0,1,4,0,5,0,0,1,3,3,3,1,0,8,4,3,4,1,0,0,5,0,2,1,2,0,14,583.6,279.0,71.2,3.918539326,13.0,363.1,95.4,51.8,55.7,29.3,17.7,4.8,4.4,52.8,183.5,0.0,1.6,3.9,54.5,123.5,697.5,0.0,0.0,0.0,0.4,0.4,0.0,0.0,334.5,184.9,44.0,563.5,229.2,0.0,697.5
.872652785160364,19,MISC,14,F,Black or African American,"Not Hispanic, Latino, or Spanish Origin",41,25.0,0.48,<0.08,29.2,9.1,10.0,365.0,0.0,4.44,16.98,100.25,59.5,Critical Care Medicine,y,5.456956018497294,5.0,Vent,0,1,2,0,1,0,1,2,1,1,1,0,0,2,3,2,4,1,1,0,3,0,2,1,2,0,17,527.9,105.0,41.7,2.517985612,7.4,154.1,95.8,174.2,60.3,24.9,99.2,50.1,116.0,78.6,120.6,0.0,1.6,8.5,75.0,35.5,1292.8,753.1,0.0,539.7,16.0,1.7,5.8,8.5,343.9,232.2,59.2,635.3,548.3,0.0,0.0
.23406364427549356,57,MISC,4,M,Other Race,"Hispanic, Latino, or Spanish Origin",14,14.0,0.25,11.1,21.5,7.3,9.5,198.0,0.0,9.28,,102.2,53,Cardiovascular Surgery,y,4.802083333401242,4.0,BiPAP/CPAP,0,2,5,0,0,0,0,3,2,0,1,0,0,4,4,1,3,2,0,0,4,0,2,1,2,0,9,655.0,232.2,30.9,7.514563107,18.0,281.1,146.0,97.2,87.0,30.5,19.0,11.5,15.9,65.7,154.4,0.2,3.0,13.8,62.0,75.4,965.2,0.0,0.0,0.0,1.7,0.5,1.3,0.0,175.6,117.7,30.7,324.0,199.4,36.2,965.2
.6971105031373198,51,MISC,6,M,Black or African American,"Not Hispanic, Latino, or Spanish Origin",206,204.0,0.51,16.81,35.3,12.1,12.9,70.0,0.0,4.16,,99.21875,62.96875,Emergency Room,n,0.0,3.0,NC or Mask,0,0,0,0,3,0,0,1,1,0,1,0,0,5,3,0,0,1,0,0,1,0,2,1,0,0,6,779.8,167.5,48.7,3.439425051,1.0,217.2,197.3,333.4,101.8,56.3,39.4,30.3,57.2,115.7,361.9,0.0,0.1,23.0,89.2,249.6,1618.6,0.0,0.0,83.3,7.0,1.9,4.7,0.4,194.5,182.2,32.7,409.4,252.1,207.4,1535.3
.49992935498692614,64,MISC,3,F,Unknown,"Not Hispanic, Latino, or Spanish Origin",27,31.0,0.34,6.66,30.4,9.9,10.2,460.0,0.0,4.49,20.53,,,Critical Care Medicine,y,7.13896990739886,,,0,1,3,0,0,0,0,1,0,0,1,0,0,3,0,0,0,0,0,0,0,0,0,0,0,0,0,650.878573,156.766872,12.119725,12.934853884886,47.444454,216.331052,117.236427,223.693798,52.738055,31.630217,37.92576,23.171003,40.378547,81.120293,214.001114,0.0,0.0,7.207292,42.986674,163.807148,1239.351048,53.886883,0.0,164.31901,4.831821,1.979844,0.498743,2.353234,266.97556,172.779504,61.272377,501.027441,494.108811,130.966818,1021.145154
.6011495875514469,39,Hospitalized,11,M,Black or African American,"Not Hispanic, Latino, or Spanish Origin",25,56.0,0.42,,21.7,8.0,9.8,268.0,0.0,10.68,16,114,60,Hematology,n,0.0,,,0,0,0,0,0,0,0,0,0,1,0,0,0,0,0,0,0,0,0,0,0,0,0,0,0,0,3,259.3,70.9,23.6,3.004237288,4.7,99.3,40.6,98.5,18.1,9.3,41.4,47.8,98.8,33.7,57.2,0.1,0.0,0.0,23.6,33.4,569.7,263.6,53.3,252.8,12.1,3.1,5.2,3.8,239.7,149.5,74.4,463.6,464.5,0.0,0.0
.5828114581672948,71,Hospitalized,14,M,Black or African American,"Not Hispanic, Latino, or Spanish Origin",,,0.47,,,,,,,,29.14,113.19148936170212,75.17021276595744,Critical Care Medicine,y,51.283506944499095,5.0,Vent,1,5,2,9,0,2,2,6,0,3,3,1,0,12,8,4,4,4,5,3,7,3,3,0,7,2,43,1079.4,132.78608,16.870987,7.85798817,33.2874,182.944466,168.48802,315.804632,77.486356,46.6258,44.860381,20.674772,46.072874,108.53004,314.191671,0.001315,0.619101,5.318373,55.488958,252.763924,1599.996924,0.0,0.0,57.89357,5.762405,1.806856,2.191585,1.763964,217.565239,186.550557,36.32014,440.435936,457.195079,203.643679,1542.103353
.6718157501503246,41,Hospitalized,16,M,Black or African American,"Not Hispanic, Latino, or Spanish Origin",62,29.0,0.32,,32.7,9.4,14.1,75.0,0.0,13.97,59,120.54761904761904,56.88095238095238,Critical Care Medicine,y,70.45621527780168,5.0,Vent,2,10,5,9,3,3,4,11,3,0,1,5,6,22,4,10,4,10,3,2,6,3,4,0,7,3,31,642.4,242.8,108.5,2.237788018,17.3,368.6,174.4,163.9,142.7,51.0,77.4,35.6,83.0,88.1,302.8,0.1,7.7,22.2,38.8,234.1,1345.2,64.2,352.7,928.3,11.9,0.8,6.3,4.8,240.4,206.4,75.1,521.9,227.8,0.0,0.0
.9049213358869325,68,Hospitalized,4,M,Other Race,"Hispanic, Latino, or Spanish Origin",,,0.22,,33.6,11.0,10.4,451.0,0.7756944444408873,8.46,13.31,116.07317073170732,73.95121951219512,Critical Care Medicine,y,43.58975694450055,5.0,Vent,1,0,2,1,0,0,0,0,0,0,0,6,0,2,9,5,5,2,6,1,6,0,3,1,8,0,29,159.2,41.7,18.6,2.241935484,1.8,62.0,18.7,21.1,8.6,3.0,8.7,9.4,18.8,11.3,18.0,0.0,0.0,0.0,7.7,10.2,181.1,60.2,0.0,0.0,2.6,0.4,1.1,1.1,51.6,87.0,8.3,146.9,120.3,0.0,120.9
.5552280387379905,110,Hospitalized,17,F,Unknown,"Not Hispanic, Latino, or Spanish Origin",,,0.43,,,,,,,,20.91,121.25,66,Nephrology,n,0.0,,,0,0,0,0,0,0,1,0,0,0,0,0,0,0,5,4,3,2,2,1,5,5,1,0,1,0,19,,,,,,,,,,,,,,,,,,,,,,,,,,,,,,,,,,,
.6824877569929034,4,Hospitalized,19,M,Black or African American,"Not Hispanic, Latino, or Spanish Origin",Null,,1.23,,,,,,,,29.96,105,67,Nephrology,n,0.0,,,0,0,0,0,0,0,0,0,0,0,0,1,0,0,0,0,0,0,0,0,0,0,0,0,0,0,1,,,,,,,,,,,,,,,,,,,,,,,,,,,,,,,,,,,
.5942064381455368,83,Hospitalized,0,M,Other Race,"Hispanic, Latino, or Spanish Origin",95,74.0,0.2,<0.08,36.0,12.6,10.3,482.0,0.0,14.3,18.69,97.75,66.28571428571429,Emergency Room,n,0.0,3.0,NC or Mask,0,2,0,0,0,0,0,1,0,0,0,0,0,1,3,0,0,0,0,0,0,0,0,0,0,0,3,265.5,230.9,60.3,3.829187396,9.6,300.8,84.0,121.2,54.8,11.6,65.8,43.9,110.7,58.2,53.0,1.0,0.0,0.9,51.1,0.0,1069.3,38.8,473.2,557.2,20.0,1.3,1.9,16.8,207.5,160.2,50.2,417.8,399.9,0.0,0.0
.6984008001752318,46,Hospitalized,22,F,Black or African American,"Not Hispanic, Latino, or Spanish Origin",,,,,,,,,,,,118.92857142857144,70.64285714285714,Laboratory Medicine,n,0.0,,,0,0,0,0,0,0,0,0,0,0,0,0,0,0,5,5,3,2,4,0,0,0,0,0,2,4,25,706.210525,83.178699,0.0,,20.556928,103.735627,71.272139,119.210683,42.488702,9.345028,78.723,31.142656,61.7963,57.166021,34.07051,0.07463699999999998,2.09905,0.680794,31.21603,0.0,1066.148443,502.012144,0.0,564.136299,7.310178,1.01618,6.293998,0.0,154.421471,91.578734,18.040399,264.040604,391.605299,0.0,0.0
.6328737850118203,78,Hospitalized,1,F,Black or African American,"Not Hispanic, Latino, or Spanish Origin",,,,5.59,31.7,10.5,9.5,142.0,0.0,6.5,,111.27272727272728,71.54545454545455,Emergency Room,n,0.0,1.0,Room Air,0,0,0,0,0,0,0,2,0,3,1,0,0,0,3,5,0,0,0,0,0,0,0,0,0,2,4,706.1,881.6,172.9,5.098901099,4.0,1058.5,93.4,210.6,31.9,20.5,161.0,29.1,75.8,145.1,157.6,0.2,0.2,0.7,33.9,122.5,3036.8,43.1,22.5,2971.2,13.0,0.0,5.4,7.6,192.2,152.8,33.5,378.5,232.2,0.0,0.0
,97,Hospitalized,5,M,Other Race,"Hispanic, Latino, or Spanish Origin",23,26.0,0.27,,35.3,12.2,9.9,362.0,0.0,14.12,13.21,104.5,62.4,Emergency Room,n,0.0,3.0,NC or Mask,0,1,0,0,0,0,0,2,0,0,0,0,0,0,2,0,0,0,1,0,0,0,2,0,0,2,3,470.0,950.9,234.0,4.063675214,12.3,1197.2,66.6,163.7,28.6,10.6,98.7,54.4,123.2,77.7,71.4,0.3,0.0,0.4,16.8,53.8,1427.4,329.4,550.7,547.3,17.7,1.1,8.6,8.1,212.5,137.8,42.5,392.7,270.2,0.0,0.0
.6737171939602085,53,Hospitalized,6,M,Other Race,"Hispanic, Latino, or Spanish Origin",41,33.0,0.52,,38.8,12.9,9.5,369.0,0.0,8.63,29.79,110.9795918367347,54.36734693877551,Critical Care Medicine,y,7.67232638889982,4.0,BiPAP/CPAP,0,6,0,0,0,0,0,2,0,0,0,0,0,1,3,3,2,1,1,0,1,0,2,0,0,3,5,434.2,88.8,42.5,2.089411765,11.5,142.8,47.3,118.5,16.7,5.8,60.8,51.9,111.1,50.7,36.2,0.0,0.6,0.0,21.2,14.4,929.6,36.6,568.2,324.8,17.3,1.6,7.7,8.0,154.6,108.8,37.9,301.3,395.2,0.0,0.0
.43649163574731226,23,Hospitalized,12,F,Unknown,"Not Hispanic, Latino, or Spanish Origin",27,25.0,0.13,,35.4,11.6,12.0,183.0,0.0,4.1,20.25,87.66666666666667,59.06060606060606,Critical Care Medicine,y,26.410277777795272,5.0,Vent,0,5,7,2,5,0,0,4,1,0,1,1,0,6,3,5,4,1,1,0,2,0,2,0,1,3,24,681.1,800.6,207.8,3.852743022,15.1,1023.6,30.9,83.6,11.3,5.9,39.2,38.4,81.9,34.0,37.9,0.1,0.0,0.7,20.4,16.7,592.2,57.2,390.6,144.4,11.9,0.9,5.0,6.0,23.5,42.4,0.0,65.8,253.7,0.0,0.0
.8861060179024078,40,Hospitalized,8,M,Black or African American,"Not Hispanic, Latino, or Spanish Origin",21,12.0,0.34,.46,33.8,11.7,9.3,489.0,0.0,11.62,Null,104.5,74,Emergency Room,n,0.0,1.0,Room Air,1,0,0,0,0,0,0,1,0,0,0,0,0,0,0,0,0,0,0,0,0,0,1,0,0,0,0,501.2,65.2,41.7,1.563549161,20.5,127.4,273.5,162.3,239.0,32.6,87.3,42.5,97.0,74.9,95.4,5.2,11.5,11.2,0.0,67.5,1404.7,164.9,392.6,847.2,14.4,0.6,10.1,3.7,228.1,129.7,72.3,430.0,676.2,0.0,0.0
.3870088262374128,7,Hospitalized,17,F,Other Race,"Hispanic, Latino, or Spanish Origin",28,30.0,0.6,,,,,,,,43.82,114.5625,71.41666666666667,Critical Care Medicine,y,6.8826388888046495,4.0,BiPAP/CPAP,0,3,0,0,0,0,0,3,0,0,0,0,0,0,2,4,1,1,0,1,0,0,0,0,0,0,3,739.2,2194.7,392.5,5.591592357,9.4,2596.6,114.4,208.4,54.2,25.3,51.4,19.5,42.1,82.9,174.3,0.1,3.0,11.9,0.0,159.3,1453.0,22.1,0.0,657.8,6.2,0.3,4.8,1.0,436.4,319.1,77.1,832.6,317.1,112.2,773.1
.5476152595828381,2,Hospitalized,23,M,Other Race,"Hispanic, Latino, or Spanish Origin",493,296.0,0.81,1.06,37.8,11.6,12.4,178.0,0.0,6.65,Null,100,54.333333333333336,Critical Care Medicine,y,30.589814814804413,5.0,Vent,1,4,1,0,1,0,1,3,0,1,0,0,0,1,6,6,3,2,4,1,4,0,1,0,6,1,21,608.0,354.5,264.5,1.34026465,54.6,673.6,464.6,306.2,416.4,100.6,149.5,56.0,111.3,162.2,407.6,0.3,30.5,96.1,114.3,166.3,2650.7,339.9,0.0,2310.8,17.3,2.8,0.6,13.9,350.4,263.9,93.1,707.4,367.9,0.0,0.0
.5737577309465176,6,Hospitalized,19,M,Black or African American,"Not Hispanic, Latino, or Spanish Origin",53,80.0,0.59,3.54,25.3,9.3,10.8,333.0,-0.1819444444408873,18.85,28.2,116.16666666666669,55.833333333333336,Emergency Room,n,0.0,3.0,NC or Mask,0,0,1,0,0,0,1,4,0,3,0,1,0,5,6,2,5,2,0,0,0,0,0,0,2,3,11,441.16735,71.632199,18.96473,3.76842105,29.954849,120.551778,80.218406,119.082587,53.88401,31.258545,58.509477,29.314565,64.603903,64.320588,204.157453,0.17962,0.594597,1.801143,61.433846,140.148247,1014.633306,70.319627,0.0,944.313679,8.371025,1.642709,5.134968,1.593349,334.455584,141.864269,44.013615,520.333469,397.304266,0.0,0.0
,74,Hospitalized,1,M,Other Race,"Hispanic, Latino, or Spanish Origin",12,25.0,0.28,,,,,,,,Null,99,70.5,Emergency Room,n,0.0,1.0,Room Air,0,0,0,0,1,0,0,0,1,0,0,4,0,5,0,0,0,0,1,0,0,0,0,0,2,0,5,410.1,111.4,34.2,3.257309942,13.4,159.0,116.9,169.3,78.0,31.3,87.3,50.7,135.1,81.8,174.8,0.2,0.1,30.1,37.6,106.7,1373.7,203.5,233.6,936.7,22.1,0.7,6.1,15.3,231.2,204.6,43.0,478.8,367.7,0.0,0.0
.8764461397147036,49,Hospitalized,6,M,Black or African American,"Not Hispanic, Latino, or Spanish Origin",35,60.0,0.32,,20.8,7.8,9.9,895.0,0.0,8.78,16.5,105,44,Hematology,n,0.0,,,0,0,0,0,0,0,0,0,0,1,0,0,0,2,0,0,0,0,0,0,0,0,0,0,0,0,1,219.3,64.7,13.1,4.938931298,16.3,94.2,52.4,142.7,17.0,6.9,56.7,79.1,150.9,43.4,48.7,0.2,0.2,0.0,13.1,35.2,801.1,282.3,44.1,474.7,16.1,7.4,4.1,4.6,205.8,131.6,78.7,416.1,327.4,0.0,0.0
.5568884154377016,96,Hospitalized,15,F,Black or African American,"Not Hispanic, Latino, or Spanish Origin",58,49.0,0.65,,36.6,12.4,9.0,263.0,0.0,2.86,47.84,105,68.66666666666667,Emergency Room,n,0.0,4.0,BiPAP/CPAP,0,2,0,0,0,1,0,2,0,0,0,0,0,1,3,1,2,1,0,0,0,0,1,0,1,1,6,789.5,227.4,78.8,2.885786802,13.3,319.5,46.5,100.9,22.7,9.4,60.0,31.5,87.8,52.0,70.7,0.2,0.1,0.0,3.5,66.9,1010.4,131.8,172.7,705.8,14.5,0.1,4.0,10.4,303.7,266.8,63.4,634.0,561.1,0.0,0.0
,86,Hospitalized,15,F,Other Race,"Hispanic, Latino, or Spanish Origin",,,0.66,.95,39.7,12.5,11.7,211.0,-0.8222222222248092,3.84,35.98,112.4,73.4,Emergency Room,n,0.0,3.0,NC or Mask,1,2,0,0,0,0,0,2,0,0,0,0,0,1,3,1,2,0,0,0,0,0,0,0,0,0,1,610.7,377.5,43.7,8.638443936,8.3,429.5,64.7,97.8,41.8,14.6,50.5,32.6,75.9,46.6,71.5,0.1,0.6,7.2,37.8,25.8,839.6,138.2,63.5,637.8,11.1,0.7,3.7,6.6,360.4,265.2,81.6,707.2,457.4,0.0,0.0